*Heading
** Job name: Cantilever_TET4 Model name: Model-1
** Generated by: Abaqus/CAE 6.13-4
*Preprint, echo=NO, model=NO, history=NO, contact=NO
**
** PARTS
**
*Part, name=Part-1
*End Part
**
**
** ASSEMBLY
**
*Assembly, name=Assembly
**
*Instance, name=Part-1-1, part=Part-1
*Node
*Element, type=C3D4
*Nset, nset=Set-1, generate
*Elset, elset=Set-1, generate
** Section: Section-1
*Solid Section, elset=Set-1, material=Material-1
*End Instance
**
*Nset, nset=Set-20, instance=Part-1-1
*Elset, elset=Set-20, instance=Part-1-1
*End Assembly
**
** MATERIALS
**
*Material, name=Material-1
*Density
 7.85,
*Elastic
 2e+08, 0.3
** ----------------------------------------------------------------
**
** STEP: Step-1
**
*Step, name=Step-1, nlgeom=NO
*Static
1., 1., 1e-05, 1.
**
** BOUNDARY CONDITIONS
**
** Name: BC-1 Type: Symmetry/Antisymmetry/Encastre
*Boundary
Set-20, PINNED
**
** LOADS
**
** Name: Load-1   Type: Gravity
*Dload
, GRAV, 9.81, 0., 0., -1.
**
** OUTPUT REQUESTS
**
*Restart, write, frequency=0
**
** FIELD OUTPUT: F-Output-1
**
*Output, field, variable=PRESELECT
**
** HISTORY OUTPUT: H-Output-1
**
*Output, history, variable=PRESELECT
*End Step